cd Debug
~/tizen-studio/tools/ninja
/usr/bin/ld: cannot find crtbeginS.o: Нет такого файла или каталога
clang-3.9: error: linker command failed with exit code 1 (use -v to see invocation)
ninja: build stopped: subcommand failed.
and in tuzen-studio
FAILED: clang
clang: error while loading shared libraries: libtinfo.so.5: cannot open shared object file: No such file or directory
ninja: build stopped: subcommand failed.
mistakes at assembly of the project
and in tuzen-studio
BY
04 Nov 2024
Tizen Studio
BY
02 Apr 2024
Tizen Studio
BY
30 Oct 2023
Tizen Studio